{"text_format":"1","workbook":"xlsx","n_sheets":3,"sheets":["Lists","Introduction","Decision Tree"],"not_rendered":{"charts":0,"images":1,"macros":1,"external_links":0,"defined_names":21,"comments":0,"pivot_tables":0},"unopened":[],"bounds":{"document_bytes":16777216,"sheet_cells":100000,"rows_first":2000,"rows_last":500,"rows_between":2000,"halvings":0,"cell_chars":16384,"cell_head_chars":4096},"cells_cut":0,"cells_raw":0,"read":"whole","date_system":"1900"}

{"sheet":"Lists","index":0,"n_rows":30,"n_cols":24,"rows_kept":30,"cut":false,"hidden":true,"merged":[]}
[null,null,null,null,null,null,null,null,null,"Use this list for medical too"]
[null,"Purpose",null,"YesNo",null,"Age",null,"Locations",null,"Residence",null,"Orphanage",null,"Service",null,"YoungTeach",null,"Community",null,"CommunityUnder12",null,"None",null,"URLs"]
[null,"Prevalence/disaggregation",null,"Yes",null,"2 to 4",null,"Household",null,"Parent or Legal Guardian",null,"Orphanage staff member who knows the child well",null,"Teacher or service provider, staff member, or volunteer with direct knowledge of the child",null,"Teacher or service provider, staff member, or volunteer with direct knowledge of the child",null,"Parent or Legal Guardian",null,"Parent or Legal Guardian",null,"No answer choice, move to next question",null,"https://data.unicef.org/resources/module-child-functioning/"]
[null,"Individual Identification",null,"No",null,"5 to 11",null,"Refugee camp",null,"Child themself",null,"Child themself",null,"Child themself",null,"Parent or Legal Guardian",null,"Service provider, staff member, or volunteer with direct knowledge of the child",null,"Service provider, staff member, or volunteer with direct knowledge of the child",null,null,null,"http://www.washingtongroup-disability.com/washington-group-question-sets/short-set-of-disability-questions/"]
[null,null,null,null,null,"12 to 17",null,"Orphanage",null,null,null,null,null,"Parent or Legal Guardian",null,null,null,"Child themself",null,null,null,null,null,"mailto:meloeb52@gmail.com,WG_Secretariat@cdc.gov"]
[null,null,null,null,null,null,null,"Community center"]
[null,null,null,null,null,null,null,"School"]
[null,null,null,null,null,null,null,"Daycare/Childcare center"]
[]
[]
[]
[]
[]
[]
[null,null,null,null,null,null,null,"YoungList","Respondents","OldList","Respondents"]
[null,null,null,null,null,null,null,"Community center","Parent or Legal Guardian","Household","Parent or Legal Guardian"]
[null,null,null,null,null,null,null,"Community center","Service provider, staff member, or volunteer with direct knowledge of the child","Household","Child themself"]
[null,null,null,null,null,null,null,"School","Teacher or service provider, staff member, or volunteer with direct knowledge of the child","Refugee camp","Parent or Legal Guardian"]
[null,null,null,null,null,null,null,"School","Parent or Legal Guardian","Refugee camp","Child themself"]
[null,null,null,null,null,null,null,"Daycare/Childcare center","Teacher or service provider, staff member, or volunteer with direct knowledge of the child","Orphanage","Orphanage staff member who knows the child well"]
[null,null,null,null,null,null,null,"Daycare/Childcare center","Parent or Legal Guardian","Orphanage","Child themself"]
[null,null,null,null,null,null,null,null,null,"Community center","Parent or Legal Guardian"]
[null,null,null,null,null,null,null,null,null,"Community center","Service provider, staff member, or volunteer with direct knowledge of the child"]
[null,null,null,null,null,null,null,null,null,"Community center","Child themself"]
[null,null,null,null,null,null,null,null,null,"School","Teacher or service provider, staff member, or volunteer with direct knowledge of the child"]
[null,null,null,null,null,null,null,null,null,"School","Child themself"]
[null,null,null,null,null,null,null,null,null,"School","Parent or Legal Guardian"]
[null,null,null,null,null,null,null,null,null,"Daycare/Childcare center","Teacher or service provider, staff member, or volunteer with direct knowledge of the child"]
[null,null,null,null,null,null,null,null,null,"Daycare/Childcare center","Child themself"]
[null,null,null,null,null,null,null,null,null,"Daycare/Childcare center","Parent or Legal Guardian"]

{"sheet":"Introduction","index":1,"n_rows":25,"n_cols":3,"rows_kept":25,"cut":false,"hidden":false,"merged":[[0,1,0,10],[2,1,2,2],[3,1,3,10],[5,2,5,9],[7,1,7,10],[1,1,1,10],[22,1,22,10],[24,2,24,9],[12,2,12,9],[14,1,14,10],[16,2,16,9],[17,1,20,1],[17,2,17,9],[17,10,20,10],[18,2,18,9],[19,2,19,9],[20,2,20,9],[9,1,12,1],[9,2,9,9],[9,10,12,10],[10,2,10,9],[11,2,11,9]]}
[null,"DISABILITY IDENTIFICATION TOOL SELECTION GUIDE: Introduction"]
[null,"Last updated: July 2020"]
[]
[null,"PURPOSE"]
[]
[null,null,"This Disability Identification Tool Selection Guide is intended to help you determine which data collection tool is most appropriate for collecting data on children with disabilities in your early grade education activities. This is not intended to guide your research design. Prior to using this guide, you will need to determine the key features of your design such as purpose, functional domains, age group, data collection setting, etc. In addition, important considerations such as consent, enumerator training needs, data dissemination, and reporting are not captured in this simple guide.\n\nThe decision tree graphic to the right provides an overview of how to move through the interactive decision tree located on the next tab and notes questions you will be asked along the way."]
[]
[null,"INTENDED USER"]
[]
[null,null,"This guide is intended for those who have a basic understanding of research design, data collection, the social model of disability, and Washington Group functional domains. Users should also be somewhat familiar with the different data collection tools that can be utilized to collect disability data. If you would like to use this tool but do not yet have this base knowledge, please explore the resources below."]
[null,null,"USAID's How-To Note: Disability Inclusive Education"]
[null,null,"Washington Group on Disability Statistics Short Set of Disability Questions (WGSS)"]
[null,null,"UNICEF's Module on Child Functioning (CFM)"]
[]
[null,"OUTCOMES"]
[]
[null,null,"The interactive decision tree (tab 2) will direct you to one or more data collection tools if an appropriate tool exists. In some cases, the tool may not yet be validated for your specific context. The decision tree directs users down two main branches, or purposes. As guidance on individual screening tools has not yet been finalized, the individual identification branch is truncated and provides a place holder for yet to be determined individual screening tools. The prevalence/disaggregation branch considers the social model functioning questionnaires that are currently available. This is a living document that will be updated as more tools are identified, created, and validated. The currently available social model functioning questionnaires that are included in this decision tree are:"]
[null,null,"● WGSS               "]
[null,null,"● CFM ages 2-4 "]
[null,null,"● CFM ages 5-17"]
[null,null,"● CFM-Teacher Version (TV) "]
[]
[null,"INSTRUCTIONS"]
[]
[null,null,"To use this guide, please click on the decision tree tab below. A series of questions will appear in column C. Please answer all questions using the dropdown menus in column D. When you first begin, you will only see one question. Additional questions will appear as you work your way through the decision tree. If you are using the macro-enabled version of the guide, you can clear your answers at any time by hitting the \"Clear All\" button. If you are not using the macro-enabled version you can clear your answers by highlighting all the answers and pressing the \"delete\" or \"backspace\" key.\n\nPlease note: The first question asks for your purpose for collecting data. If your study has dual purposes, you will need to go through the decision tree for each purpose in order to select the appropriate tool for that purpose."]

{"sheet":"Decision Tree","index":2,"n_rows":64,"n_cols":8,"rows_kept":64,"cut":false,"hidden":false,"merged":[]}
[null,"DISABILITY IDENTIFICATION TOOL SELECTION GUIDE"]
[]
[null,null,"Instructions"]
[]
[null,1,"Welcome to the interactive tool selection decision tree. The purpose of this guide is to help you to decide which tool is most appropriate for your research needs. If your study has multiple purposes, you will need to go through this once for each purpose."]
[]
[null,2,"A series of questions will appear below in column C. Please answer all questions using the dropdown menus in column D. When you first begin, you will only see one question. Additional questions will appear as you work your way through the decision tree. The questions you see will depend on the answers you provide to the preceding questions. Click in the cells in column D beside each question to see response options. When column C does not contain a question, column D will appear in grey."]
[]
[null,3,"Once you have made a selection, you cannot change your answer to a previous question, though you can delete the answer. To ensure the accuracy of the tool, if you choose to delete one answer, please delete all answers and restart from the beginning. You can do so easily by clicking the \"Clear All\" button in the next column."]
[]
[]
[null,null,"Read the questions below in order","Click in the cells below to select an answer for each question that appears in column C",null,null,null,"HIDE: Text for questions"]
[null,"Purpose","For what purpose will you be gathering this data?",null,null,null,null,"Purpose Screening"]
[null,{"$f":"IF(C14=H14,G14,IF(C14=H28,G28,\"\"))","v":""},{"$f":"IF(D13=Lists!B3,H28,IF(D13=Lists!B4,H14,\"\"))","v":""},null,null,null,"Medical or functional screening","This means that you will require a medical or functional screening tool. There is a range of tools that can be used for these screenings. Under the World Bank's Inclusive Education Initiative, UNICEF will be conducting a review of current screening and assessment activities and approaches in a range of countries and regions. Following this, they will provide guidance on which tools to select and how to conduct such assessments. Once available, this information will be incorporated into this decision tree."]
[null,{"$f":"IF(C15=H18,G18,IF(C15=H16,G16,IF(C15=H30,G30,IF(C15=H40,G40,\"\"))))","v":""},{"$f":"IF(D14=Lists!D3,H18,IF(D14=Lists!D4,H16,IF(D14=Lists!F3,H30,IF(OR(D14=Lists!F4,D14=Lists!F5),H40,\"\"))))","v":""},null,null,null,null,"Medical screening text"]
[null,{"$f":"IF(C16=H20,G20,IF(C16=H19,G19,IF(C16=H32,G32, IF(C16=H35,G35,IF(C16=H36,G36,IF(C16=H31,G31,IF(C16=H34,G34,IF(C16=H33,G33,\"\"))))))))","v":""},{"$f":"IF(D15=Lists!D3,H20,IF(D15=Lists!D4,H19,IF(OR(D14=Lists!F4,D14=Lists!F5),\"\",IF(D15=Lists!H3,H32,IF(D15=Lists!H4,H33,IF(OR(D15=Lists!H7,D15=Lists!H8),H31,IF(D15=Lists!H8,\"\",IF(D15=Lists!H6,H31,IF(D15=Lists!H5,H34,\"\")))))))))","v":""},null,null,null,"Stop","Do not collect data. If no plans are made to provide accommodation or referral to children and youth identified with functional difficulties there is no purpose in collecting this data."]
[]
[null,{"$f":"IF(C18=H22,G22,IF(C18=H21,G21,IF(C18=H37,G37,IF(C18=H38,G38,IF(C18=H41,G41,IF(C18=H60,G60,IF(C18=H61,G61,\"\")))))))","v":""},{"$f":"IF(OR($D$14=Lists!F4,$D$14=Lists!F5),H41,IF(D16=Lists!T3,H37,IF(OR(D16=Lists!P3,D16=Lists!T4),H38,IF(D16=Lists!D3,H22,IF(D16=Lists!D4,H21,IF(C16=H36,HYPERLINK(Lists!X5,H60),IF(OR(C16=H32,C16=H33,C16=H34,C16=H35),HYPERLINK(Lists!X3,H61),\"\")))))))","v":""},null,null,null,"Inclusion","If in a school setting, will the services provided to identified students be included in the general education system (i.e. the data will not be used to segregate students into special schools)?"]
[null,{"$f":"IF(C19=H42,G42,IF(C19=H60,G60,IF(C19=H61,G61,\"\")))","v":""},{"$f":"IF(OR($D$14=Lists!F4,$D$14=Lists!F5),H42,IF(C18=H38,HYPERLINK(Lists!X5,H60),IF(C18=H37,HYPERLINK(Lists!X3,H61),IF(C18=H60,HYPERLINK(Lists!X3,H61),\"\"))))","v":""},null,null,null,"Stop","Do not collect data. Inclusive approaches to education of children with functional difficulties are better for the children/youth and their peers. This data should not be used to segregate children and youth into special schools."]
[null,{"$f":"IF(C20=H43,G43,IF(C20=H44,G44,IF(C20=H61,G61,IF(C20=H64,G64,\"\"))))","v":""},{"$f":"IF(AND(D18<>\"\",D19=Lists!D3),H43,IF(AND(D18=Lists!D3,D19=Lists!D4),H44,IF(AND(D18=Lists!D4,D19=Lists!D4),H64,IF(C19=H60,HYPERLINK(Lists!X3,H61),\"\"))))","v":""},null,null,null,"Consent","Will you seek and obtain informed consent from each child's parent or legal guardian before conducting the screening with that child?"]
[null,{"$f":"IF(C21=H31,G31,\"\")","v":""},{"$f":"IF(OR(D20=Lists!H6,D20=Lists!H7,D20=Lists!H8,AND(D14=Lists!F5,ISTEXT(D20))),H31,\"\")","v":""},null,null,null,"Stop","Do not collect data. Parental consent must be obtained for each child who participates in these screenings."]
[null,{"$f":"IF(C22<>\"\",G45,\"\")","v":""},{"$f":"IF(AND(D19=Lists!D4,OR(AND(C21=\"\",D20=Lists!H3),AND(D21=Lists!J3,OR(D20=Lists!H7,D20=Lists!H8)))),H46,IF(AND(D19=Lists!D4,AND(C21=\"\",D20=Lists!H4)),H47,IF(AND(D19=Lists!D4,AND(C21=\"\",D20=Lists!H5)),H48,IF(AND(D19=Lists!D4,AND(D21=Lists!J3,OR(D20=Lists!H3))),H46,IF(AND(D19=Lists!D4,AND(D21=Lists!J3,D20=Lists!H4)),H47,IF(AND(D19=Lists!D4,AND(D21=Lists!L3,D20=Lists!H5)),H48,IF(AND(D19=Lists!D4,AND(D20=Lists!H6,D21=Lists!T3)),H51,IF(AND(D19=Lists!D3,OR(AND(C21=\"\",D20=Lists!H3),AND(D21=Lists!J3,OR(D20=Lists!H7,D20=Lists!H8)))),H54,IF(AND(D19=Lists!D3,AND(C21=\"\",D20=Lists!H4)),H55,IF(AND(D19=Lists!D3,AND(C21=\"\",D20=Lists!H5)),H56,IF(AND(D19=Lists!D3,AND(D21=Lists!J3,OR(D20=Lists!H3))),H54,IF(AND(D19=Lists!D3,AND(D21=Lists!J3,D20=Lists!H4)),H55,IF(AND(D19=Lists!D3,AND(D21=Lists!L3,D20=Lists!H5)),H56,IF(AND(D19=Lists!D3,AND(D20=Lists!H6,D21=Lists!T3)),H59,IF(AND(D19=Lists!D4,D21=Lists!J4),H50,IF(AND(D19=Lists!D4,OR(D21=Lists!N3,D21=Lists!R4)),H49,IF(AND(D19=Lists!D4,AND(OR(D20=Lists!H7,D20=Lists!H8),D21=Lists!N3)),H49,IF(AND(D19=Lists!D3,D21=Lists!J4),H58,IF(AND(D19=Lists!D3,OR(D21=Lists!N3,D21=Lists!R4)),H57,IF(AND(D19=Lists!D3,AND(OR(D20=Lists!H7,D20=Lists!H8),D14=Lists!N3)),H57,\"\"))))))))))))))))))))","v":""},null,null,null,"Further guidance to be developed","There is a range of tools that can be used for medical or functional screening. Under the World Bank's Inclusive Education Initiative, UNICEF will be conducting a review of current screening and assessment activities and approaches in a range of countries and regions. Following this, they will provide guidance on which tools to select and how to conduct such assessments. Once available, this information will be incorporated into this decision tree."]
[null,{"$f":"IF(C23=H52,G52,IF(C23=H60,G60,IF(C23=H61,G61,IF(C23=H62,G62,\"\"))))","v":""},{"$f":"IF(AND(D19=Lists!D4,OR(C22=H46,C22=H47,C22=H48,C22=H49,C22=H50,C22=H51)),H52,IF(AND(OR(C22=H49,C22=H57),D19=Lists!D3),HYPERLINK(Lists!X5,H60),IF(AND(D19=Lists!D3,OR(C22=H46,C22=H47,C22=H48,C22=H50,C22=H51,C22=H54,C22=H55,C22=H56,C22=H58,C22=H59)),HYPERLINK(Lists!X3,H61),\"\")))","v":""},null,null,null,null,"Age question"]
[null,{"$f":"IF(C24=H60,G60,IF(C24=H61,G61,IF(C24=H62,G62,\"\")))","v":""},{"$f":"IF(AND(OR(C22=H49,C22=H57),C23=H52),HYPERLINK(Lists!X5,H60),IF(AND(C23=H52,OR(C22=H46,C22=H47,C22=H48,C22=H50,C22=H51,C22=H54,C22=H55,C22=H56,C22=H58,C22=H59)),HYPERLINK(Lists!X3,H61),IF(C23=H60,HYPERLINK(Lists!X3,H61),\"\")))","v":""}]
[null,{"$f":"IF(C25=H61,G61,IF(C25=H62,G62,\"\"))","v":""},{"$f":"IF(AND(C23=H52,C24=H60),HYPERLINK(Lists!X3,H61),IF(AND(C23=H52,C24=H61),HYPERLINK(Lists!X4,H62),\"\"))","v":""}]
[null,{"$f":"IF(C26=H62,G62,\"\")","v":""},{"$f":"IF(AND(C23=H52,C25=H61),HYPERLINK(Lists!X4,H62),\"\")","v":""}]
[]
[null,null,null,null,null,null,"Age","What age range are you investigating?"]
[null,null,null,null,null,null,null,"CFM ages 2-4"]
[null,null,null,null,null,null,"Location","This means you will be using the CFM for ages 2-4, as no other tool has been tested and validated for that age range. We will ask you a few more questions based on your research plans to determine the best approach to using this tool. Where do you plan to gather data?"]
[null,null,null,null,null,null,"Respondent","Who will be your respondent?"]
[null,null,null,null,null,null,"CFM 2-4, Household, Parent or Guardian","In this case, you should use the CFM for ages 2-4 using the parent or legal guardian as the respondent. To collect this data, you will need enumerators."]
[null,null,null,null,null,null,"CFM 2-4, Refugee Camp, Parent or Guardian","In this case, you should use the CFM for ages 2-4 using a staff member at the orphanage who knows the child well as the respondent. To collect this data, you will need enumerators. The CFM has not been validated for use in refugee camp settings."]
[null,null,null,null,null,null,"CFM 2-4, Orphanage, Adult Service Provider","In this case, you should use the CFM for ages 2-4 using a staff member at the orphanage who knows the child well as the respondent. To collect this data, you will need enumerators. The CFM has not been validated for use in orphanages."]
[null,null,null,null,null,null,"CFM 2-4, Medical Center, Parent or Guardian","In this case, you should use the CFM for ages 2-4 using the parent or legal guardian as the respondent. To collect this data, you will need enumerators."]
[null,null,null,null,null,null,"CFM 2-4, Education, Teacher or Service Provider","In this case, you should use the CFM for ages 2-4 using either a teacher or service provider, staff member, or volunteer with direct knowledge of the child as the respondent. The CFM has not been validated for use with teacher respondents for children at this age range. The CFM-TV has been pilot tested with older children/youth in secondary school and has shown promising results. However, it requires more testing to be fully validated, particularly for young children. The CFM-TV has not been tested outside of secondary school contexts or with service providers who are not teachers as respondents. In the pilot test, the teachers filled out the form themselves."]
[null,null,null,null,null,null,"CFM 2-4, Community Center, Parent or Guardian","In this case, you should use the CFM for ages 2-4 using the parent or legal guardian as the respondent. To collect this data, you will need enumerators. The CFM has not been validated for use in community centers."]
[null,null,null,null,null,null,"In this case, you should use the CFM for ages 2-4. The CFM has not been validated for use with service provider, staff member, of volunteer respondents for children at this age range. The CFM-TV has been pilot tested with older children/youth in secondary school and has shown promising results. However, it requires more testing to be fully validated, particularly for young children. The CFM-TV has not been tested outside of secondary school contexts or with service providers who are not teachers as respondents. In the pilot test, the teachers filled out the form themselves.","In this case, you should use the CFM for ages 2-4. The CFM has not been validated for use with a service provider, staff member, or volunteer respondents for children at this age range. The CFM-TV has been pilot tested with older children/youth in secondary school and has shown promising results. However, it requires more testing to be fully validated, particularly for young children. The CFM-TV has not been tested outside of secondary school contexts or with service providers who are not teachers as respondents. In the pilot test, the teachers filled out the form themselves."]
[null,null,null,null,null,null,null,"WGSS, CFM ages 5-17"]
[null,null,null,null,null,null,"Functional areas","This means that you may use the WGSS, the CFM for ages 5-17, or the CFM-TV. We will ask some more questions to determine which makes the most sense for you."]
{"$rows_left_out":24}